{"text_format":"2","workbook":"xlsx","n_sheets":7,"sheets":["2D","2M","2S","3T","3P","4P","Segédlap"],"not_rendered":{"charts":0,"images":0,"macros":0,"external_links":3,"defined_names":2,"comments":0,"pivot_tables":0},"unopened":[],"bounds":{"document_bytes":16777216,"sheet_cells":100000,"run_cost":"one","rows_first":2000,"rows_last":500,"rows_between":2000,"halvings":0,"cell_chars":16384,"cell_head_chars":4096},"cells_cut":0,"cells_raw":0,"read":"whole","date_system":"1900"}

{"sheet":"2D","index":0,"n_rows":19,"n_cols":20,"rows_kept":19,"cut":false,"hidden":false,"merged":[[0,0,0,6],[4,2,4,5],[4,8,4,12],[6,0,7,0],[6,1,7,1],[6,2,7,2],[6,3,7,3],[6,4,7,4],[6,19,7,19],[18,0,18,3],[19,0,19,3],[6,13,7,13],[6,14,7,14],[6,15,7,15],[6,16,7,16],[6,17,7,17],[6,18,7,18],[6,5,7,5],[6,6,7,6],[6,7,6,8],[6,9,6,10],[6,11,7,11],[6,12,7,12]]}
["Nem tanári mesterszakot követő egyszakos tanári mesterképzés (2 félév, 60 kredit)"]
[]
[]
[]
["KÉPZÉS kódja, neve:","MTKBMAG_2D",{"$f":"VLOOKUP($B$5,[3]Segédlap!A:B,2,0)","v":"magyar nyelv és irodalom szakos tanár"},{"$nulls":4},"TAGOZAT:","Mindkettőt megadom egy táblázatban"]
["Tanári KKK:","https://uj.jogtar.hu/#doc/db/1/id/A1300008.EMM/ts/20211230/lr/chain4"]
["MÉRFÖLDKŐ (önálló csoportosító sor) KÓDJA","TÁRGYCSOPORT KÓDJA","TÁRGYKÓD","MK/TCS/tárgy NEVE/CÍME","TÁRGY TÍPUSA","TÁRGY-KÖVETELMÉNY","FELVÉTEL TÍPUSA","ÓRASZÁM",null,"FÉLÉV ÉS KREDIT",null,"AJÁNLOTT FÉLÉV","KREDIT-SZÁM","TÁRGY(CSOPORT)-FELELŐS Neptun kódja","TÁRGY(CSOPORT)-FELELŐS neve","VÉGLEGES IDŐSZAK (TELJESÍTÉS)","VÉGLEGES IDŐSZAK (FELVÉTEL)","ELŐZETES VIZSGAFELTÉTEL","ÚJ","Tartalmában nem változott, így összevonható az előző KKK szerinti alábbi tárggyal"]
[{"$nulls":7},"heti","féléves","1.","2."]
["MK-SZM",null,null,"Szakmódszertan","nincs megadva","nincs megadva","kötelező",{"$nulls":5},10,{"$nulls":5},"X"]
[null,null,"RK2D-MAG-SZM1","A magyar nyelv és irodalom oktatásának elméleti alapjai","szeminárium","gyakorlati jegy","kötelező",2,9,2,null,1,2,"WR1BAF","Zsigriné dr. Sejtes Györgyi",null,null,null,"X"]
[null,null,"RK2D-MAG-SZM2","Az irodalomtanítás gyakorlata ","szeminárium","gyakorlati jegy","kötelező",2,9,2,null,1,2,"WR1BAF","Zsigriné dr. Sejtes Györgyi",null,null,null,"X"]
[null,null,"RK2D-MAG-SZM3","Az anyanyelvtanítás gyakorlata","szeminárium","gyakorlati jegy","kötelező",2,9,null,2,2,2,"WR1BAF","Zsigriné dr. Sejtes Györgyi",null,null,null,"X"]
[null,null,"RK2D-MAG-SZM4","Tanítást kísérő szakmódszertani szeminárium","szeminárium","gyakorlati jegy","kötelező",2,9,null,2,2,2]
[null,null,"RK2D-MAG-SZMSZV1","Magyar nyelv és irodalom tanítása a digitális kollaborációs térben","szeminárium","gyakorlati jegy","kötelezően választható",2,9,2,null,1,2,"WR1BAF","Zsigriné dr. Sejtes Györgyi",null,null,null,"X"]
[null,null,"RK2D-MAG-SZMSZV2","Szövegtan és tanulás","szeminárium","gyakorlati jegy","kötelezően választható",2,9,2,null,1,2,"WR1BAF","Zsigriné dr. Sejtes Györgyi",null,null,null,"X"]
["MK-TGY",null,null,"Szakterületi tanítási gyakorlat","nincs megadva","nincs megadva","kötelező",null,null,null,2,2,2,{"$nulls":5},"X"]
[]
[{"$nulls":8},"Előírt kredit:",6,6,null,12]
[{"$nulls":8},"Számolt kredit:",{"$f":"SUM(J10:J15)","v":8},{"$f":"SUM(K10:K15)","v":4}]

{"sheet":"2M","index":1,"n_rows":15,"n_cols":19,"rows_kept":15,"cut":false,"hidden":false,"merged":[[0,0,0,6],[6,13,7,13],[4,2,4,5],[4,8,4,13],[6,0,7,0],[6,1,7,1],[6,2,7,2],[6,3,7,3],[6,4,7,4],[6,5,7,5],[6,6,7,6],[6,7,6,8],[6,9,6,10],[6,12,7,12],[6,14,7,14],[6,15,7,15],[6,16,7,16],[6,17,7,17],[6,18,7,18]]}
["Mesterképzéssel párhuzamos tanárképzés"]
[]
[]
[]
["KÉPZÉS kódja, neve:","MTKBMAG_2M","magyar nyelv és irodalom szakos tanár (mesterképzéssel párhuzamosan)",{"$nulls":4},"TAGOZAT:","Mindkettőt megadom egy táblázatban"]
[]
["MÉRFÖLDKŐ (önálló csoportosító sor) KÓDJA","TÁRGYCSOPORT KÓDJA","TÁRGYKÓD","MK/TCS/tárgy NEVE/CÍME","TÁRGY TÍPUSA","TÁRGY-KÖVETELMÉNY","FELVÉTEL TÍPUSA","ÓRASZÁM",null,"FÉLÉV ÉS KREDIT",null,null,"AJÁNLOTT FÉLÉV","KREDIT-SZÁM","TÁRGY(CSOPORT)-FELELŐS Neptun kódja","TÁRGY(CSOPORT)-FELELŐS neve","VÉGLEGES IDŐSZAK (TELJESÍTÉS)","VÉGLEGES IDŐSZAK (FELVÉTEL)","ELŐZETES VIZSGAFELTÉTEL"]
[{"$nulls":7},"heti","féléves","1.","2.","3."]
["MK-SZM",null,null,"Szakmódszertan","nincs megadva","nincs megadva","kötelező",{"$nulls":6},10]
[null,null,"RK2M-MAG-SZM1","A magyar nyelv és irodalom oktatásának elméleti alapjai","szeminárium","gyakorlati jegy","kötelező",2,9,2,null,null,1,2,"WR1BAF","Zsigriné dr. Sejtes Györgyi"]
[null,null,"RK2M-MAG-SZM2","Az irodalomtanítás gyakorlata ","szeminárium","gyakorlati jegy","kötelező",2,9,2,null,null,1,2,"WR1BAF","Zsigriné dr. Sejtes Györgyi"]
[null,null,"RK2M-MAG-SZM3","Az anyanyelvtanítás gyakorlata","szeminárium","gyakorlati jegy","kötelező",2,9,null,2,null,2,2,"WR1BAF","Zsigriné dr. Sejtes Györgyi"]
[null,null,"RK2M-MAG-SZM4","Tanítást kísérő szakmódszertani szeminárium","szeminárium","gyakorlati jegy","kötelező",2,9,null,null,2,2,2]
[null,null,"RK2M-MAG-SZMSZV1","Magyar nyelv és irodalom tanítása a digitális kollaborációs térben","szeminárium","gyakorlati jegy","kötelezően választható",2,9,2,null,null,1,2,"WR1BAF","Zsigriné dr. Sejtes Györgyi"]
[null,null,"RK2M-MAG-SZMSZV2","Szövegtan és tanulás","szeminárium","gyakorlati jegy","kötelezően választható",2,9,2,null,null,1,2,"WR1BAF","Zsigriné dr. Sejtes Györgyi"]

{"sheet":"2S","index":2,"n_rows":40,"n_cols":19,"rows_kept":40,"cut":false,"hidden":false,"merged":[[0,0,0,7],[4,2,4,4],[4,8,4,11],[6,0,7,0],[6,1,7,1],[6,2,7,2],[6,3,7,3],[6,4,7,4],[6,5,7,5],[6,16,7,16],[6,17,7,17],[6,18,7,18],[6,6,7,6],[6,7,7,7],[6,8,6,9],[6,10,6,11],[6,12,7,12],[6,13,7,13],[39,0,39,3],[40,0,40,3],[41,0,41,3],[6,14,7,14],[6,15,7,15]]}
["Szaktanári mesterképzés (2 félév, 60 kredit) – Ped. 1. besorolással "]
[]
[]
[]
["KÉPZÉS kódja, neve:","MTSSMAG_2S",{"$f":"VLOOKUP($B$5,[3]Segédlap!A:B,2,0)","v":"magyar nyelv és irodalom szakos szaktanár"},{"$nulls":4},"TAGOZAT:","Mindkettőt megadom egy táblázatban"]
[]
["KKK 8. szerinti ismeretkör: kredittartomány","MÉRFÖLDKŐ (önálló csoportosító sor) KÓDJA","TÁRGYCSOPORT KÓDJA","TÁRGYKÓD","MK/TCS/tárgy NEVE/CÍME","TÁRGY TÍPUSA","TÁRGY-KÖVETELMÉNY","FELVÉTEL TÍPUSA","ÓRASZÁM",null,"FÉLÉV ÉS KREDIT",null,"AJÁNLOTT FÉLÉV","KREDIT-SZÁM","TÁRGY(CSOPORT)-FELELŐS Neptun kódja","TÁRGY(CSOPORT)-FELELŐS neve","VÉGLEGES IDŐSZAK (TELJESÍTÉS)","VÉGLEGES IDŐSZAK (FELVÉTEL)","ELŐZETES VIZSGAFELTÉTEL"]
[{"$nulls":8},"heti","féléves","1.","2."]
[null,"MK-KOT",null,null,"Kötelező szakmai tárgyak","nincs megadva","nincs megadva","kötelező",{"$nulls":5},45]
["Nyelvtudományi ismeretek (21 kredit)",null,null,"RK2S-MAG-KOT01","Grammatikai ismeretek: alaktani és mondattani elemzések","szeminárium","gyakorlati jegy","kötelező",2,9,3,null,1,3,"EMQWVX","Németh Miklós"]
[null,null,null,"RK2S-MAG-KOT02","Szöveg és stílus előadás","előadás","kollokvium","kötelező",2,9,3,null,1,3,"GHO3PX","Schirm Anita"]
[null,null,null,"RK2S-MAG-KOT03","Kommunikáció és retorika előadás                                                                                     ","előadás","kollokvium","kötelező",2,9,3,null,1,3,"GHO3PX","Schirm Anita"]
[null,null,null,"RK2S-MAG-KOT04","A pragmatikai, a jelentésbeli és a nyelvtani szintek, diskurzuselemzés szeminárium","szeminárium","gyakorlati jegy","kötelező",2,9,null,3,2,3,"BQEUFH","Németh T. Enikő"]
[null,null,null,"RK2S-MAG-KOT05","A nyelvészet külső kapcsolatai és alkalmazásai szeminárium (pszicholingvisztika, anyanyelv-elsajátítás, számítógépes nyszet, lexikográfia stb.)                                                 ","szeminárium","gyakorlati jegy","kötelező",2,9,null,3,2,3,"EMQWVX","Németh Miklós"]
[null,null,null,"RK2S-MAG-KOT06","Nyelvtörténet (legfontosabb nyelvemlékeink komplex elemzése, a szó-, a névkincs és a frazeológia története stb.) szeminárium                                                                             ","szeminárium","gyakorlati jegy","kötelező",2,9,null,3,2,3,"OUAWUI","Forgács Tamás"]
[null,null,null,"RK2S-MAG-KOT07","Nyelv és társadalom előadás","előadás","kollokvium","kötelező",2,9,null,3,2,3,"EMQWVX","Németh Miklós"]
["Irodalomtudományi ismeretek (24 kredit)",null,null,"RK2S-MAG-KOT08","Műfaj- és eszmetörténet a régi magyar irodalomban","előadás","kollokvium","kötelező",2,9,3,null,1,3,"TW358K","Molnár Dávid"]
[null,null,null,"RK2S-MAG-KOT09","Műfaj- és eszmetörténet a klasszikus magyar irodalomban ","előadás","kollokvium","kötelező",2,9,3,null,1,3,"GPZTBK","Gere Zsolt"]
[null,null,null,"RK2S-MAG-KOT10","Műfaj- és eszmetörténet a modern magyar és a határon túli irodalomban ","előadás","kollokvium","kötelező",2,9,null,3,2,3,"FODBN0","Virág Zoltán"]
[null,null,null,"RK2S-MAG-KOT11","Világirodalom és komparatisztika ","előadás","kollokvium","kötelező",2,9,3,null,1,3,"BGWKTE","Kelemen Zoltán"]
{"$rows_left_out":21}
{"sheet":"3T","index":3,"n_rows":101,"n_cols":19,"rows_kept":101,"cut":false,"hidden":false,"merged":[[3,17,4,17],[3,18,4,18],[50,0,50,3],[3,7,3,8],[3,12,4,12],[3,13,4,13],[3,14,4,14],[3,15,4,15],[3,0,4,0],[3,1,4,1],[3,2,4,2],[3,3,4,3],[3,4,4,4],[3,5,4,5],[3,6,4,6],[53,4,54,4],[53,5,54,5],[53,6,54,6],[3,16,4,16],[53,16,54,16],[53,17,54,17],[53,18,54,18],[100,0,100,3],[2,2,2,8],[52,2,52,8],[3,9,3,11],[53,9,53,11],[53,7,53,8],[53,12,54,12],[53,13,54,13],[53,14,54,14],[53,15,54,15],[53,0,54,0],[53,1,54,1],[53,2,54,2],[53,3,54,3]]}
["Tanári szakképzettség birtokában újabb (más szakos) tanári oklevelet adó tanárképzés (90 kredit)",{"$nulls":14},"3T"]
[]
["KÉPZÉS kódja, neve:","MTKBMAG_3T_N_2024",{"$f":"VLOOKUP($B$3,Segédlap!A:B,2,0)","v":"magyar nyelv és irodalom szakos tanár (más tanári)"}]
["MÉRFÖLDKŐ (önálló csoportosító sor) KÓDJA","TÁRGYCSOPORT KÓDJA","TÁRGYKÓD","MK/TCS/tárgy NEVE/CÍME","TÁRGY TÍPUSA","TÁRGY-KÖVETELMÉNY","FELVÉTEL TÍPUSA","ÓRASZÁM",null,"FÉLÉV ÉS KREDIT",null,null,"KREDIT-SZÁM","Ajánlott félév","TÁRGY(CSOPORT)-FELELŐS Neptun kódja","TÁRGY(CSOPORT)-FELELŐS neve","VÉGLEGES IDŐSZAK (TELJESÍTÉS)","VÉGLEGES IDŐSZAK (FELVÉTEL)","ELŐZETES VIZSGAFELTÉTEL"]
[{"$nulls":7},"heti","féléves","1.","2.","3."]
["MK-KOT",null,null,"Kötelező szakmai tárgyak","Nincs megadva","Nincs megadva","Kötelező",{"$nulls":5},76]
[null,"TCS-RK3TN-MAG-KOT",null,null,"Nincs megadva","Nincs megadva","Kötelező"]
["Nyelvtudományi alapozó tárgyak ",null,"RK3TN-MAG-KOT1"," Bevezetés a nyelvtudományba","Előadás","Kollokvium","Kötelező",2,null,3,null,null,3,1,"BQEUFH","Németh T. Enikő"]
[null,null,"RK3TN-MAG-KOT2","Nyelvtudományi proszeminárium","Szeminárium","Gyakorlati jegy","Kötelező",2,null,2,null,null,2,1,"WR1BAF","Sinkovics Balázs"]
["Nyelvtudományi ismeretek",null,"RK3TN-MAG-KOT3","Leíró magyar hangtan szeminárium","Szeminárium","Gyakorlati jegy","Kötelező",2,null,2,null,null,2,1,"WR1BAF","Sinkovics Balázs"]
[null,null,"RK3TN-MAG-KOT4","Szófajtan és alaktan előadás                                                                                     ","Előadás","Kollokvium","Kötelező",2,null,null,2,null,2,2,"FZ2JFS","Berente Anikó"]
[null,null,"RK3TN-MAG-KOT5","Szófajtan és alaktan szeminárium                                                                          ","Szeminárium","Gyakorlati jegy","Kötelező",2,null,null,2,null,2,2,"FZ2JFS","Berente Anikó"]
[null,null,"RK3TN-MAG-KOT6","Mondattan előadás                                                      ","Előadás","Kollokvium","Kötelező",2,null,2,null,null,2,1,"FZ2JFS","Berente Anikó"]
[null,null,"RK3TN-MAG-KOT7","Mondattan szeminárium                                                                             ","Szeminárium","Gyakorlati jegy","Kötelező",2,null,3,null,null,3,1,"FZ2JFS","Berente Anikó"]
[null,null,"RK3TN-MAG-KOT8","Stílus és jelentés","Előadás","Kollokvium","Kötelező",2,null,null,2,null,2,2,"GHO3PX","Schirm Anita"]
[null,null,"RK3TN-MAG-KOT9","Szövegtani ismeretek                                                                                                ","Előadás","Kollokvium","Kötelező",2,null,null,2,null,2,2,"WR1BAF","Zsigriné dr. Sejtes Györgyi"]
[null,null,"RK3TN-MAG-KOT10","Kommunikáció szóban és írásban  ","Szeminárium","Gyakorlati jegy","Kötelező",2,null,null,2,null,2,2,"WR1BAF","Sinkovics Balázs"]
[null,null,"RK3TN-MAG-KOT11","Nyelv és társadalom                           ","Előadás","Kollokvium","Kötelező",2,null,null,3,null,3,2,"EMQWVX","Németh Miklós"]
[null,null,"RK3TN-MAG-KOT12","Nyelvtörténet előadás                                    ","Előadás","Kollokvium","Kötelező",2,null,null,null,3,3,3,"OUAWUI","Forgács Tamás"]
[null,null,"RK3TN-MAG-KOT13","A magyar nyelv történeti változásai az egyes szinteken ","Szeminárium","Gyakorlati jegy","Kötelező",2,null,null,null,3,3,3,"OUAWUI","Forgács Tamás"]
{"$rows_left_out":82}
{"sheet":"3P","index":4,"n_rows":102,"n_cols":19,"rows_kept":102,"cut":false,"hidden":false,"merged":[[3,15,4,15],[3,16,4,16],[3,17,4,17],[3,18,4,18],[50,0,50,3],[3,5,4,5],[3,6,4,6],[3,7,3,8],[3,12,4,12],[3,13,4,13],[3,0,4,0],[3,1,4,1],[3,2,4,2],[3,3,4,3],[3,4,4,4],[54,3,55,3],[54,4,55,4],[54,5,55,5],[54,6,55,6],[3,14,4,14],[54,16,55,16],[54,17,55,17],[54,18,55,18],[101,0,101,3],[2,2,2,8],[52,2,52,8],[3,9,3,11],[54,9,54,11],[54,7,54,8],[54,12,55,12],[54,13,55,13],[54,14,55,14],[54,15,55,15],[54,0,55,0],[54,1,55,1],[54,2,55,2]]}
["Pedagógus szakképzettség birtokában újabb (más szakos) tanári oklevelet adó tanárképzés (90 kredit)",{"$nulls":14},"3P"]
[]
["KÉPZÉS kódja, neve:","MTKBMAG_3P_N_2024",{"$f":"VLOOKUP($B$3,Segédlap!A:B,2,0)","v":"magyar nyelv és irodalom szakos tanár (tanítóknak)"}]
["MÉRFÖLDKŐ (önálló csoportosító sor) KÓDJA","TÁRGYCSOPORT KÓDJA","TÁRGYKÓD","MK/TCS/tárgy NEVE/CÍME","TÁRGY TÍPUSA","TÁRGY-KÖVETELMÉNY","FELVÉTEL TÍPUSA","ÓRASZÁM",null,"FÉLÉV ÉS KREDIT",null,null,"KREDIT-SZÁM","Ajánlott félév","TÁRGY(CSOPORT)-FELELŐS Neptun kódja","TÁRGY(CSOPORT)-FELELŐS neve","VÉGLEGES IDŐSZAK (TELJESÍTÉS)","VÉGLEGES IDŐSZAK (FELVÉTEL)","ELŐZETES VIZSGAFELTÉTEL"]
[{"$nulls":7},"heti","féléves","1.","2.","3."]
["MK-KOT",null,null,"Kötelező szakmai tárgyak","Nincs megadva","Nincs megadva","Kötelező",{"$nulls":5},76]
[null,"TCS-RK3PN-MAG-KOT"]
["Nyelvtudományi alapozó tárgyak ",null,"RK3PN-MAG-KOT1"," Bevezetés a nyelvtudományba","Előadás","Kollokvium","Kötelező",2,null,3,null,null,3,1,"BQEUFH","Németh T. Enikő"]
[null,null,"RK3PN-MAG-KOT2","Nyelvtudományi proszeminárium","Szeminárium","Gyakorlati jegy","Kötelező",2,null,2,null,null,2,1,"WR1BAF","Sinkovics Balázs"]
["Nyelvtudományi ismeretek",null,"RK3PN-MAG-KOT3","Leíró magyar hangtan szeminárium","Szeminárium","Gyakorlati jegy","Kötelező",2,null,2,null,null,2,1,"WR1BAF","Sinkovics Balázs"]
[null,null,"RK3PN-MAG-KOT4","Szófajtan és alaktan előadás                                                                                     ","Előadás","Kollokvium","Kötelező",2,null,null,2,null,2,2,"FZ2JFS","Berente Anikó"]
[null,null,"RK3PN-MAG-KOT5","Szófajtan és alaktan szeminárium                                                                          ","Szeminárium","Gyakorlati jegy","Kötelező",2,null,null,2,null,2,2,"FZ2JFS","Berente Anikó"]
[null,null,"RK3PN-MAG-KOT6","Mondattan előadás                                                      ","Előadás","Kollokvium","Kötelező",2,null,2,null,null,2,1,"FZ2JFS","Berente Anikó"]
[null,null,"RK3PN-MAG-KOT7","Mondattan szeminárium                                                                             ","Szeminárium","Gyakorlati jegy","Kötelező",2,null,3,null,null,3,1,"FZ2JFS","Berente Anikó"]
[null,null,"RK3PN-MAG-KOT8","Stílus és jelentés","Előadás","Kollokvium","Kötelező",2,null,null,2,null,2,2,"GHO3PX","Schirm Anita"]
[null,null,"RK3PN-MAG-KOT9","Szövegtani ismeretek                                                                                                ","Előadás","Kollokvium","Kötelező",2,null,null,2,null,2,2,"WR1BAF","Zsigriné dr. Sejtes Györgyi"]
[null,null,"RK3PN-MAG-KOT10","Kommunikáció szóban és írásban  ","Szeminárium","Gyakorlati jegy","Kötelező",2,null,null,2,null,2,2,"WR1BAF","Sinkovics Balázs"]
[null,null,"RK3PN-MAG-KOT11","Nyelv és társadalom                           ","Előadás","Kollokvium","Kötelező",2,null,null,3,null,3,2,"EMQWVX","Németh Miklós"]
[null,null,"RK3PN-MAG-KOT12","Nyelvtörténet előadás                                    ","Előadás","Kollokvium","Kötelező",2,null,null,null,3,3,3,"OUAWUI","Forgács Tamás"]
[null,null,"RK3PN-MAG-KOT13","A magyar nyelv történeti változásai az egyes szinteken ","Szeminárium","Gyakorlati jegy","Kötelező",2,null,null,null,3,3,3,"OUAWUI","Forgács Tamás"]
{"$rows_left_out":83}
{"sheet":"4P","index":5,"n_rows":55,"n_cols":19,"rows_kept":55,"cut":false,"hidden":false,"merged":[[0,0,0,7],[2,2,2,4],[2,8,2,11],[4,0,5,0],[4,1,5,1],[4,2,5,2],[4,3,5,3],[4,4,5,4],[4,17,5,17],[4,18,5,18],[4,5,5,5],[4,6,5,6],[4,7,4,8],[4,9,4,12],[4,13,5,13],[4,14,5,14],[54,0,54,3],[55,0,55,3],[56,0,56,3],[4,15,5,15],[4,16,5,16]]}
["Újabb oklevelet adó tanárképzés tanítói szakképzettséggel (4 félév, 120 kredit)"]
[]
["KÉPZÉS kódja, neve:","MTKBMAG_4P",{"$f":"VLOOKUP($B$3,[3]Segédlap!A:B,2,0)","v":"magyar nyelv és irodalom szakos tanár"},{"$nulls":4},"TAGOZAT:","Mindkettőt megadom egy táblázatban"]
[]
["MÉRFÖLDKŐ (önálló csoportosító sor) KÓDJA","TÁRGYCSOPORT KÓDJA","TÁRGYKÓD","MK/TCS/tárgy NEVE/CÍME","TÁRGY TÍPUSA","TÁRGY-KÖVETELMÉNY","FELVÉTEL TÍPUSA","ÓRASZÁM",null,"FÉLÉV ÉS KREDIT",null,null,null,"KREDIT-SZÁM","TÁRGY(CSOPORT)-FELELŐS Neptun kódja","TÁRGY(CSOPORT)-FELELŐS neve","VÉGLEGES IDŐSZAK (TELJESÍTÉS)","VÉGLEGES IDŐSZAK (FELVÉTEL)","ELŐZETES VIZSGAFELTÉTEL"]
[{"$nulls":7},"heti","féléves","1.","2.","3.","4."]
["MK-KOT",null,null,"Kötelező szakmai tárgyak","nincs megadva","nincs megadva","kötelező",{"$nulls":6},84]
["Nyelvészeti alapozó ismeretek (5 kredit)",null,"RK4P-MAG-KOT01"," Bevezetés a nyelvtudományba","előadás","kollokvium","kötelező",2,9,3,null,null,null,3,"BQEUFH","Németh T. Enikő"]
[null,null,"RK4P-MAG-KOT02","Nyelvtudományi proszeminárium","szeminárium","gyakorlati jegy","kötelező",2,9,2,null,null,null,2,"WR1BAF","Sinkovics Balázs"]
["Nyelvtudományi ismeretek (34 kredit)",null,"RK4P-MAG-KOT03","A magyar nyelv rokonsága     ","szeminárium","gyakorlati jegy","kötelező",2,9,2,null,null,null,2,"PMYQE3","Sipőcz Katalin"]
[null,null,"RK4P-MAG-KOT04","Leíró magyar hangtan szeminárium","szeminárium","gyakorlati jegy","kötelező",2,9,2,null,null,null,2,"WR1BAF","Sinkovics Balázs"]
[null,null,"RK4P-MAG-KOT05","Szófajtan és alaktan előadás                                                                                     ","előadás","kollokvium","kötelező",2,9,null,3,null,null,3,"HEQ6YF","Hoffmann Ildikó"]
[null,null,"RK4P-MAG-KOT06","Mondattan szeminárium                                                                             ","szeminárium","gyakorlati jegy","kötelező",2,9,2,null,null,null,2,"HEQ6YF","Hoffmann Ildikó"]
[null,null,"RK4P-MAG-KOT07","Stílus és jelentés","előadás","kollokvium","kötelező",2,9,null,null,3,null,3,"GHO3PX","Schirm Anita"]
[null,null,"RK4P-MAG-KOT08","Szövegtani ismeretek                                                                                                ","előadás","kollokvium","kötelező",2,9,null,2,null,null,2,"WR1BAF","Zsigriné dr. Sejtes Györgyi"]
[null,null,"RK4P-MAG-KOT09","Szövegelemzés, szövegalkotás","szeminárium","gyakorlati jegy","kötelező",2,9,null,null,2,null,2,"WR1BAF","Zsigriné dr. Sejtes Györgyi"]
[null,null,"RK4P-MAG-KOT10","Pragmatikai ismeretek és kommunikációs stratégiák","előadás","kollokvium","kötelező",2,9,null,null,3,null,3,"BQEUFH","Németh T. Enikő"]
[null,null,"RK4P-MAG-KOT11","Nyelv és társadalom                           ","előadás","kollokvium","kötelező",2,9,null,3,null,null,3,"EMQWVX","Németh Miklós"]
[null,null,"RK4P-MAG-KOT12","Nyelvi jogok, nyelvi diszkrimináció, nyelvi tervezés ","előadás","kollokvium","kötelező",2,9,null,null,2,null,2,"EMQWVX","Németh Miklós"]
[null,null,"RK4P-MAG-KOT13","Nyelvtörténet előadás                                    ","előadás","kollokvium","kötelező",2,9,null,null,3,null,3,"OUAWUI","Forgács Tamás"]
{"$rows_left_out":36}
{"sheet":"Segédlap","index":6,"n_rows":28,"n_cols":15,"rows_kept":28,"cut":false,"hidden":true,"merged":[[0,12,1,12],[0,13,1,13],[0,14,1,14]]}
["Szakkód","Szakok","Kredit",null,"TAGOZAT",{"$nulls":5},"SZAKOK",null,"TÁRGY TÍPUSA","TÁRGY-KÖVETELMÉNY","FELVÉTEL TÍPUSA"]
["MTKBANG_2B_L_2024","angol nyelv és kultúra tanára (alapszakos diplomával)",60,null,"Nappali",{"$nulls":5},"angol nyelv és kultúra szaktanára"]
["MTKBANG_2B_N_2024","angol nyelv és kultúra tanára (alapszakos diplomával)",60,null,"Levelező",{"$nulls":5},"angol nyelv és kultúra tanára",null,"Előadás","Kollokvium","Kötelező"]
["MTKBMAG_2B_L_2024","magyar nyelv és irodalom szakos tanár (alapszakos diplomával)",60,{"$nulls":7},"dráma- és színházismeret-tanár",null,"Szeminárium","Gyakorlati jegy","Kötelezően választható"]
["MTKBMAG_2B_N_2024","magyar nyelv és irodalom szakos tanár (alapszakos diplomával)",60,{"$nulls":7},"etikatanár",null,"Gyakorlat","Minősített aláírás","Szabadon választható"]
["MTKBNEK_2B_L_2024","német nyelv és kultúra tanára (alapszakos diplomával)",60,{"$nulls":7},"filozófiatanár",null,"Labor","Alapvizsga"]
["MTKBNEK_2B_N_2024","német nyelv és kultúra tanára (alapszakos diplomával)",60,{"$nulls":7},"francia nyelv és kultúra szaktanára",null,"Önálló vizsga","Szigorlat"]
["MTKBTOR_2B_L_2024","történelemtanár (alapszakos diplomával)",60,{"$nulls":7},"francia nyelv és kultúra tanára",null,"Nincs megadva","Aláírás"]
["MTKBTOR_2B_N_2024","történelemtanár (alapszakos diplomával)",60,{"$nulls":7},"latin nyelv és kultúra szaktanára",null,null,"Nincs megadva"]
["MTKBSZE_3B_L_2022","szerb és nemzetiségi szerb nyelv és kultúra tanára (alapszakos diplomával)",90,{"$nulls":7},"latin nyelv és kultúra tanára"]
["MTKBSZE_3B_N_2022","szerb és nemzetiségi szerb nyelv és kultúra tanára (alapszakos diplomával)",90]
["MTKBANG_3T_L_2024","angol nyelv és kultúra tanára (más tanári)",90]
["MTKBANG_3T_N_2024","angol nyelv és kultúra tanára (más tanári)",90,{"$nulls":7},"magyar nyelv és irodalom szakos szaktanár"]
["MTKBMAG_3T_L_2024","magyar nyelv és irodalom szakos tanár (más tanári)",90,{"$nulls":7},"magyar nyelv és irodalom szakos tanár"]
["MTKBMAG_3T_N_2024","magyar nyelv és irodalom szakos tanár (más tanári)",90,{"$nulls":7},"mozgóképkultúra és médiaismeret-tanár"]
["MTKBNEK_3T_L_2024","német nyelv és kultúra tanára (más tanári)",90,{"$nulls":7},"német nyelv és kultúra szaktanára"]
["MTKBNEK_3T_N_2024","német nyelv és kultúra tanára (más tanári)",90,{"$nulls":7},"német nyelv és kultúra tanára"]
["MTKBTOR_3T_L_2024","történelemtanár (más tanári)",90,{"$nulls":7},"olasz nyelv és kultúra szaktanára"]
["MTKBTOR_3T_N_2024","történelemtanár (más tanári)",90,{"$nulls":7},"olasz nyelv és kultúra tanára"]
["MTKBANG_3P_L_2024","angol nyelv és kultúra tanára (tanítóknak)",90,{"$nulls":7},"orosz nyelv és kultúra szaktanára"]
{"$rows_left_out":8}